Target
Neuropeptide Y receptor type 1
Ligand
BDBM50078968
Substrate
Meas. Tech.
ChEMBL_143983 (CHEMBL752582)
Ki
470±n/a nM
Citation
 Murakami, YHara, HOkada, THashizume, HKii, MIshihara, YIshikawa, MShimamura, MMihara, SKato, GHanasaki, KHagishita, SFujimoto, M 1,3-Disubstituted benzazepines as novel, potent, selective neuropeptide Y Y1 receptor antagonists. J Med Chem 42:2621-32 (1999)  
Target
Name:
Neuropeptide Y receptor type 1
Synonyms:
NPY-Y1 NPY1R NPYR neuropeptide Y receptor Y1
Type:
Enzyme Catalytic Domain
Mol. Mass.:
44399.07
Organism:
Homo sapiens (Human)
Description:
NPY-Y1 NPY1R HUMAN::P25929
Residue:
384
  
Inhibitor
Name:
BDBM50078968
Synonyms:
1-{9-[3-(3-Isopropyl-ureido)-benzyl]-8-oxo-6,7,8,9-tetrahydro-5-oxa-9-aza-benzocyclohepten-7-yl}-3-phenyl-urea | CHEMBL329425
Type:
Small organic molecule
Emp. Form.:
C27H29N5O4
Mol. Mass.:
487.5503
SMILES:
CC(C)NC(=O)Nc1cccc(CN2c3ccccc3OCC(NC(=O)Nc3ccccc3)C2=O)c1
: