Target
Neuropeptide Y receptor type 1
Ligand
BDBM50078974
Substrate
Meas. Tech.
ChEMBL_143983 (CHEMBL752582)
Ki
15±n/a nM
Citation
 Murakami, YHara, HOkada, THashizume, HKii, MIshihara, YIshikawa, MShimamura, MMihara, SKato, GHanasaki, KHagishita, SFujimoto, M 1,3-Disubstituted benzazepines as novel, potent, selective neuropeptide Y Y1 receptor antagonists. J Med Chem 42:2621-32 (1999)  
Target
Name:
Neuropeptide Y receptor type 1
Synonyms:
NPY-Y1 NPY1R NPYR neuropeptide Y receptor Y1
Type:
Enzyme Catalytic Domain
Mol. Mass.:
44399.07
Organism:
Homo sapiens (Human)
Description:
NPY-Y1 NPY1R HUMAN::P25929
Residue:
384
  
Inhibitor
Name:
BDBM50078974
Synonyms:
1-Isopropyl-3-{3-[3-(N'-methyl-N''-phenyl-guanidino)-2-oxo-2,3,4,5-tetrahydro-benzo[b]azepin-1-ylmethyl]-phenyl}-urea | CHEMBL330095
Type:
Small organic molecule
Emp. Form.:
C29H34N6O2
Mol. Mass.:
498.6193
SMILES:
CNC(Nc1ccccc1)=NC1CCc2ccccc2N(Cc2cccc(NC(=O)NC(C)C)c2)C1=O
: