Target
Neuropeptide Y receptor type 1
Ligand
BDBM50078990
Substrate
Meas. Tech.
ChEMBL_143983 (CHEMBL752582)
Ki
65±n/a nM
Citation
 Murakami, YHara, HOkada, THashizume, HKii, MIshihara, YIshikawa, MShimamura, MMihara, SKato, GHanasaki, KHagishita, SFujimoto, M 1,3-Disubstituted benzazepines as novel, potent, selective neuropeptide Y Y1 receptor antagonists. J Med Chem 42:2621-32 (1999)  
Target
Name:
Neuropeptide Y receptor type 1
Synonyms:
NPY-Y1 NPY1R NPYR neuropeptide Y receptor Y1
Type:
Enzyme Catalytic Domain
Mol. Mass.:
44399.07
Organism:
Homo sapiens (Human)
Description:
NPY-Y1 NPY1R HUMAN::P25929
Residue:
384
  
Inhibitor
Name:
BDBM50078990
Synonyms:
1-(3-{3-[N'-(2-Hydroxy-ethyl)-N''-(4-hydroxy-phenyl)-guanidino]-2-oxo-2,3,4,5-tetrahydro-benzo[b]azepin-1-ylmethyl}-phenyl)-3-isopropyl-urea | CHEMBL85297
Type:
Small organic molecule
Emp. Form.:
C30H36N6O4
Mol. Mass.:
544.6446
SMILES:
CC(C)NC(=O)Nc1cccc(CN2c3ccccc3CCC(N=C(NCCO)Nc3ccc(O)cc3)C2=O)c1
: