Target
Neuropeptide Y receptor type 1
Ligand
BDBM50078987
Substrate
Meas. Tech.
ChEMBL_143983 (CHEMBL752582)
Ki
88±n/a nM
Citation
 Murakami, YHara, HOkada, THashizume, HKii, MIshihara, YIshikawa, MShimamura, MMihara, SKato, GHanasaki, KHagishita, SFujimoto, M 1,3-Disubstituted benzazepines as novel, potent, selective neuropeptide Y Y1 receptor antagonists. J Med Chem 42:2621-32 (1999)  
Target
Name:
Neuropeptide Y receptor type 1
Synonyms:
NPY-Y1 NPY1R NPYR neuropeptide Y receptor Y1
Type:
Enzyme Catalytic Domain
Mol. Mass.:
44399.07
Organism:
Homo sapiens (Human)
Description:
NPY-Y1 NPY1R HUMAN::P25929
Residue:
384
  
Inhibitor
Name:
BDBM50078987
Synonyms:
1-{1-[3-(3-Isopropyl-ureido)-benzyl]-2-oxo-2,3,4,5-tetrahydro-1H-benzo[b]azepin-3-yl}-3-(4-nitro-phenyl)-urea | CHEMBL314926
Type:
Small organic molecule
Emp. Form.:
C28H30N6O5
Mol. Mass.:
530.575
SMILES:
CC(C)NC(=O)Nc1cccc(CN2c3ccccc3CCC(NC(=O)Nc3ccc(cc3)[N+]([O-])=O)C2=O)c1
: