Target
Neuropeptide Y receptor type 1
Ligand
BDBM50079002
Substrate
Meas. Tech.
ChEMBL_143983 (CHEMBL752582)
Ki
80±n/a nM
Citation
 Murakami, YHara, HOkada, THashizume, HKii, MIshihara, YIshikawa, MShimamura, MMihara, SKato, GHanasaki, KHagishita, SFujimoto, M 1,3-Disubstituted benzazepines as novel, potent, selective neuropeptide Y Y1 receptor antagonists. J Med Chem 42:2621-32 (1999)  
Target
Name:
Neuropeptide Y receptor type 1
Synonyms:
NPY-Y1 NPY1R NPYR neuropeptide Y receptor Y1
Type:
Enzyme Catalytic Domain
Mol. Mass.:
44399.07
Organism:
Homo sapiens (Human)
Description:
NPY-Y1 NPY1R HUMAN::P25929
Residue:
384
  
Inhibitor
Name:
BDBM50079002
Synonyms:
1-{1-[3-(3-Isopropyl-ureido)-benzyl]-2-oxo-2,3,4,5-tetrahydro-1H-benzo[b]azepin-3-yl}-3-(4-methoxy-phenyl)-urea | CHEMBL330574
Type:
Small organic molecule
Emp. Form.:
C29H33N5O4
Mol. Mass.:
515.6034
SMILES:
COc1ccc(NC(=O)NC2CCc3ccccc3N(Cc3cccc(NC(=O)NC(C)C)c3)C2=O)cc1
: