Target
1-phosphatidylinositol 4,5-bisphosphate phosphodiesterase beta-1
Ligand
BDBM50050924
Substrate
Meas. Tech.
ChEMBL_156498 (CHEMBL761003)
EC50
>300000±n/a nM
Citation
 Pellicciari, RMarinozzi, MCostantino, GNatalini, BMoroni, FPellegrini-Giampietro, D (2R,1'S,2'R,3'S)-2-(2'-Carboxy-3'-phenylcyclopropyl)glycine (PCCG-13), the first potent and selective competitive antagonist of phospholipase D-coupled metabotropic glutamate receptors: asymmetric synthesis and preliminary biological properties. J Med Chem 42:2716-20 (1999)  
Target
Name:
1-phosphatidylinositol 4,5-bisphosphate phosphodiesterase beta-1
Synonyms:
KIAA0581 PLCB1_HUMAN | Phospholipase C-beta-1
Type:
PROTEIN
Mol. Mass.:
138559.20
Organism:
Homo sapiens (Human)
Description:
ChEMBL_156499
Residue:
1216
  
Inhibitor
Name:
BDBM50050924
Synonyms:
(1R,2S,3S)-2-(Amino-carboxy-methyl)-3-phenyl-cyclopropanecarboxylic acid | CHEMBL72157
Type:
Small organic molecule
Emp. Form.:
C12H13NO4
Mol. Mass.:
235.2359
SMILES:
NC([C@@H]1[C@@H]([C@H]1c1ccccc1)C(O)=O)C(O)=O
: