Target
1-phosphatidylinositol 4,5-bisphosphate phosphodiesterase beta-1
Ligand
BDBM50030627
Substrate
Meas. Tech.
ChEMBL_156499 (CHEMBL761004)
IC50
150000±n/a nM
Citation
 Pellicciari, RMarinozzi, MCostantino, GNatalini, BMoroni, FPellegrini-Giampietro, D (2R,1'S,2'R,3'S)-2-(2'-Carboxy-3'-phenylcyclopropyl)glycine (PCCG-13), the first potent and selective competitive antagonist of phospholipase D-coupled metabotropic glutamate receptors: asymmetric synthesis and preliminary biological properties. J Med Chem 42:2716-20 (1999)  
Target
Name:
1-phosphatidylinositol 4,5-bisphosphate phosphodiesterase beta-1
Synonyms:
KIAA0581 PLCB1_HUMAN | Phospholipase C-beta-1
Type:
PROTEIN
Mol. Mass.:
138559.20
Organism:
Homo sapiens (Human)
Description:
ChEMBL_156499
Residue:
1216
  
Inhibitor
Name:
BDBM50030627
Synonyms:
(+-)-MCPG 4-(1-Amino-1-carboxy-ethyl)-benzoic acid CHEMBL299683 | MCPG
Type:
Small organic molecule
Emp. Form.:
C10H11NO4
Mol. Mass.:
209.1986
SMILES:
CC(N)(C(O)=O)c1ccc(cc1)C(O)=O
: