Target
Methionine aminopeptidase 2
Ligand
BDBM17594
Substrate
Meas. Tech.
ChEMBL_1895044 (CHEMBL4397079)
IC50
110±n/a nM
Citation
 Heinrich, TSeenisamy, JBlume, BBomke, JCalderini, MEckert, UFriese-Hamim, MKohl, RLehmann, MLeuthner, BMusil, DRohdich, FZenke, FT Discovery and Structure-Based Optimization of Next-Generation Reversible Methionine Aminopeptidase-2 (MetAP-2) Inhibitors. J Med Chem 62:5025-5039 (2019)  
Target
Name:
Methionine aminopeptidase 2
Synonyms:
Initiation factor 2-associated 67 kDa glycoprotein MAP2_HUMAN MNPEP Methionine aminopeptidase 2 (MetAP2) P67EIF2 p67
Type:
Enzyme
Mol. Mass.:
52884.45
Organism:
Homo sapiens (Human)
Description:
P50579
Residue:
478
  
Inhibitor
Name:
BDBM17594
Synonyms:
A-357300 N'-[(2S,3R)-3-amino-2-hydroxy-5-(propan-2-ylsulfanyl)pentanoyl]-3-chlorobenzohydrazide | bestatin-type inhibitor, 9
Type:
Small organic molecule
Emp. Form.:
C15H22ClN3O3S
Mol. Mass.:
359.871
SMILES:
CC(C)SCC[C@@H](N)[C@H](O)C(=O)NNC(=O)c1cccc(Cl)c1
: