Target
Imidazoleglycerol-phosphate dehydratase
Ligand
BDBM50079737
Substrate
Meas. Tech.
ChEBML_90659
Ki
1130±n/a nM
Citation
 Schweitzer, BALoida, PJThompson-Mize, RLCaJacob, CAHegde, SG Design and synthesis of beta-carboxamido phosphonates as potent inhibitors of imidazole glycerol phosphate dehydratase. Bioorg Med Chem Lett 9:2053-8 (1999)  
Target
Name:
Imidazoleglycerol-phosphate dehydratase
Synonyms:
HIS3 IGPD
Type:
PROTEIN
Mol. Mass.:
21976.83
Organism:
Cryptococcus neoformans
Description:
ChEMBL_90660
Residue:
202
  
Inhibitor
Name:
BDBM50079737
Synonyms:
CHEMBL65352 | [2-(3,3-Dimethyl-butyrylamino)-3-[1,2,4]triazol-1-yl-propyl]-phosphonic acid
Type:
Small organic molecule
Emp. Form.:
C11H21N4O4P
Mol. Mass.:
304.2826
SMILES:
CC(C)(C)CC(=O)NC(Cn1cncn1)CP(O)(O)=O
: