Target
Imidazoleglycerol-phosphate dehydratase
Ligand
BDBM50079724
Substrate
Meas. Tech.
ChEBML_90659
Ki
4000±n/a nM
Citation
 Schweitzer, BALoida, PJThompson-Mize, RLCaJacob, CAHegde, SG Design and synthesis of beta-carboxamido phosphonates as potent inhibitors of imidazole glycerol phosphate dehydratase. Bioorg Med Chem Lett 9:2053-8 (1999)  
Target
Name:
Imidazoleglycerol-phosphate dehydratase
Synonyms:
HIS3 IGPD
Type:
PROTEIN
Mol. Mass.:
21976.83
Organism:
Cryptococcus neoformans
Description:
ChEMBL_90660
Residue:
202
  
Inhibitor
Name:
BDBM50079724
Synonyms:
CHEMBL293454 | [2-(Cyclopropanecarbonyl-amino)-3-[1,2,4]triazol-1-yl-propyl]-phosphonic acid
Type:
Small organic molecule
Emp. Form.:
C9H15N4O4P
Mol. Mass.:
274.2136
SMILES:
OP(O)(=O)CC(Cn1cncn1)NC(=O)C1CC1
: