Target
Peptidyl-prolyl cis-trans isomerase FKBP1A
Ligand
BDBM50079767
Substrate
Meas. Tech.
ChEBML_66268
EC50
32±n/a nM
Citation
 Goulet, MTSinclair, PJWong, FStaruch, MJDumont, FJCryan, JGWiederrecht, GJWyvratt, MJParsons, WH C32-O-phenalkyl ether derivatives of the immunosuppressant ascomycin: a tether length study. Bioorg Med Chem Lett 9:2085-8 (1999)  
Target
Name:
Peptidyl-prolyl cis-trans isomerase FKBP1A
Synonyms:
12 kDa FK506-binding protein FK506-binding protein 1A FKB1A_HUMAN FKBP-1A FKBP12 Immunophilin FKBP12 PPIase FKBP1A Rotamase mTOR/FKBP12A/FKBP12B
Type:
Isomerase
Mol. Mass.:
11953.09
Organism:
Homo sapiens (Human)
Description:
P62942
Residue:
108
  
Inhibitor
Name:
BDBM50079767
Synonyms:
C32-O-Phenalkyl ether derivative of Ascomycin CHEMBL263032
Type:
Small organic molecule
Emp. Form.:
C52H79NO12
Mol. Mass.:
910.1832
SMILES:
CC[C@@H]1\C=C(C)\C[C@H](C)C[C@H](OC)[C@H]2O[C@](O)([C@H](C)C[C@@H]2OC)C(=O)C(=O)N2CCCC[C@H]2C(=O)O[C@@H]([C@H](C)[C@@H](O)CC1=O)C(\C)=C\[C@@H]1CC[C@@H](OCCCc2ccccc2)[C@@H](C1)OC
: