Target
Peptidyl-prolyl cis-trans isomerase FKBP1A
Ligand
BDBM50079775
Substrate
Meas. Tech.
ChEBML_66269
EC50
21±n/a nM
Citation
 Armstrong, HMWong, FHolmes, MASinclair, PJGoulet, MTDumont, FJStaruch, MJKoprak, SPeterson, LBRosa, RWilusz, MBWiederrecht, GJCryan, JGWyvratt, MJParsons, WH Potent immunosuppressive C32-O-arylethyl ether derivatives of ascomycin with reduced toxicity. Bioorg Med Chem Lett 9:2089-94 (1999)  
Target
Name:
Peptidyl-prolyl cis-trans isomerase FKBP1A
Synonyms:
12 kDa FK506-binding protein FK506-binding protein 1A FKB1A_HUMAN FKBP-1A FKBP12 Immunophilin FKBP12 PPIase FKBP1A Rotamase mTOR/FKBP12A/FKBP12B
Type:
Isomerase
Mol. Mass.:
11953.09
Organism:
Homo sapiens (Human)
Description:
P62942
Residue:
108
  
Inhibitor
Name:
BDBM50079775
Synonyms:
17-Ethyl-1,14-dihydroxy-12-{2-[4-(2-hydroxy-2-naphthalen-2-yl-ethoxy)-3-methoxy-cyclohexyl]-1-methyl-vinyl}-23,25-dimethoxy-13,19,21,27-tetramethyl-11,28-dioxa-4-aza-tricyclo[22.3.1.0*4,9*]octacos-18-ene-2,3,10,16-tetraone | CHEMBL407332
Type:
Small organic molecule
Emp. Form.:
C55H79NO13
Mol. Mass.:
962.2147
SMILES:
CC[C@@H]1\C=C(C)\C[C@H](C)C[C@H](OC)[C@H]2O[C@](O)([C@H](C)C[C@@H]2OC)C(=O)C(=O)N2CCCC[C@H]2C(=O)O[C@@H]([C@H](C)[C@H](O)CC1=O)C(\C)=C\C1CC[C@@H](OC[C@@H](O)c2ccc3ccccc3c2)[C@@H](C1)OC
: