Target
Muscarinic acetylcholine receptor M2
Ligand
BDBM50525122
Substrate
Meas. Tech.
ChEMBL_1895759 (CHEMBL4397794)
Ki
0.079433±n/a nM
Citation
 Pegoli, AWifling, DGruber, CGShe, XHübner, HBernhardt, GGmeiner, PKeller, M Conjugation of Short Peptides to Dibenzodiazepinone-Type Muscarinic Acetylcholine Receptor Ligands Determines M J Med Chem 62:5358-5369 (2019)  
Target
Name:
Muscarinic acetylcholine receptor M2
Synonyms:
ACM2_HUMAN Cholinergic, muscarinic M2 Muscarinic acetylcholine receptor M2 and M5 | RecName: Full=Muscarinic acetylcholine receptor M2
Type:
GPCR
Mol. Mass.:
51730.61
Organism:
Homo sapiens (Human)
Description:
P08172
Residue:
466
  
Inhibitor
Name:
BDBM50525122
Synonyms:
CHEMBL4589047
Type:
Small organic molecule
Emp. Form.:
C61H71F9N10O13
Mol. Mass.:
1323.2613
SMILES:
OC(=O)C(F)(F)F.OC(=O)C(F)(F)F.OC(=O)C(F)(F)F.C[C@H](NC(=O)[C@H](Cc1c[nH]c2ccccc12)NC(C)=O)C(=O)N[C@@H](Cc1ccc(O)cc1)C(=O)NCCN1CCN(CCCCC2CCN(CC(=O)N3c4ccccc4NC(=O)c4ccccc34)CC2)CC1
: