Target
Muscarinic acetylcholine receptor M2
Ligand
BDBM50240552
Substrate
Meas. Tech.
ChEMBL_1895768 (CHEMBL4397803)
IC50
8.1±n/a nM
Citation
 Pegoli, AWifling, DGruber, CGShe, XHübner, HBernhardt, GGmeiner, PKeller, M Conjugation of Short Peptides to Dibenzodiazepinone-Type Muscarinic Acetylcholine Receptor Ligands Determines M J Med Chem 62:5358-5369 (2019)  
Target
Name:
Muscarinic acetylcholine receptor M2
Synonyms:
ACM2_HUMAN Cholinergic, muscarinic M2 Muscarinic acetylcholine receptor M2 and M5 | RecName: Full=Muscarinic acetylcholine receptor M2
Type:
GPCR
Mol. Mass.:
51730.61
Organism:
Homo sapiens (Human)
Description:
P08172
Residue:
466
  
Inhibitor
Name:
BDBM50240552
Synonyms:
CHEMBL195
Type:
Small organic molecule
Emp. Form.:
C17H23NO3
Mol. Mass.:
289.3694
SMILES:
[H][C@@]12CC[C@]([H])(CC(C1)OC(=O)C(CO)c1ccccc1)N2C
: