Target
D(2) dopamine receptor
Ligand
BDBM50079946
Substrate
Meas. Tech.
ChEMBL_58770 (CHEMBL669158)
Ki
23±n/a nM
Citation
 Birch, AMBradley, PAGill, JCKerrigan, FNeedham, PL N-Substituted (2,3-dihydro-1,4-benzodioxin-2-yl)methylamine derivatives as D(2) antagonists/5-HT(1A) partial agonists with potential as atypical antipsychotic agents. J Med Chem 42:3342-55 (1999)  
Target
Name:
D(2) dopamine receptor
Synonyms:
DOPAMINE D2 DOPAMINE D2 Short Dopamine D2 receptor Drd2
Type:
G Protein-Coupled Receptor (GPCR)
Mol. Mass.:
50931.60
Organism:
Rattus norvegicus (rat)
Description:
P61169
Residue:
444
  
Inhibitor
Name:
BDBM50079946
Synonyms:
(2,3-Dihydro-benzo[1,4]dioxin-2-ylmethyl)-[1-(2,3-dihydro-benzo[1,4]dioxin-5-yl)-piperidin-4-ylmethyl]-amine | CHEMBL115599
Type:
Small organic molecule
Emp. Form.:
C23H28N2O4
Mol. Mass.:
396.4794
SMILES:
C(NCC1COc2ccccc2O1)C1CCN(CC1)c1cccc2OCCOc12
: