Target
D(4) dopamine receptor
Ligand
BDBM50079939
Substrate
Meas. Tech.
ChEMBL_60828 (CHEMBL675817)
Ki
70.9±n/a nM
Citation
 Birch, AMBradley, PAGill, JCKerrigan, FNeedham, PL N-Substituted (2,3-dihydro-1,4-benzodioxin-2-yl)methylamine derivatives as D(2) antagonists/5-HT(1A) partial agonists with potential as atypical antipsychotic agents. J Med Chem 42:3342-55 (1999)  
Target
Name:
D(4) dopamine receptor
Synonyms:
D(2C) dopamine receptor DOPAMINE D4.2 DRD4 Dopamine D4 receptor
Type:
Enzyme
Mol. Mass.:
48373.19
Organism:
Homo sapiens (Human)
Description:
P21917
Residue:
419
  
Inhibitor
Name:
BDBM50079939
Synonyms:
(7-Chloro-2,3-dihydro-benzo[1,4]dioxin-2-ylmethyl)-[1-(2-methoxy-phenyl)-piperidin-4-ylmethyl]-amine | CHEMBL418854
Type:
Small organic molecule
Emp. Form.:
C22H27ClN2O3
Mol. Mass.:
402.914
SMILES:
COc1ccccc1N1CCC(CNCC2COc3ccc(Cl)cc3O2)CC1
: