Target
5-hydroxytryptamine receptor 1A
Ligand
BDBM50079951
Substrate
Meas. Tech.
ChEMBL_1167 (CHEMBL616112)
Ki
16±n/a nM
Citation
 Birch, AMBradley, PAGill, JCKerrigan, FNeedham, PL N-Substituted (2,3-dihydro-1,4-benzodioxin-2-yl)methylamine derivatives as D(2) antagonists/5-HT(1A) partial agonists with potential as atypical antipsychotic agents. J Med Chem 42:3342-55 (1999)  
Target
Name:
5-hydroxytryptamine receptor 1A
Synonyms:
5-HT-1A 5-HT1A 5-hydroxytryptamine receptor 1A (5HT1A) 5ht1a Htr1a Serotonin 1a (5-HT1a) receptor/Adrenergic receptor alpha-1 | Serotonin receptor 1A
Type:
G Protein-Coupled Receptor (GPCR)
Mol. Mass.:
46445.29
Organism:
Rattus norvegicus (rat)
Description:
Binding assays were performed using rat hippocampal membranes.
Residue:
422
  
Inhibitor
Name:
BDBM50079951
Synonyms:
(8-Fluoro-2,3-dihydro-benzo[1,4]dioxin-2-ylmethyl)-[1-(2-methoxy-phenyl)-piperidin-4-ylmethyl]-amine | CHEMBL322560
Type:
Small organic molecule
Emp. Form.:
C22H27FN2O3
Mol. Mass.:
386.4598
SMILES:
COc1ccccc1N1CCC(CNCC2COc3cccc(F)c3O2)CC1
: