Target
5-hydroxytryptamine receptor 1A
Ligand
BDBM50079950
Substrate
Meas. Tech.
ChEMBL_1167 (CHEMBL616112)
Ki
3.1±n/a nM
Citation
 Birch, AMBradley, PAGill, JCKerrigan, FNeedham, PL N-Substituted (2,3-dihydro-1,4-benzodioxin-2-yl)methylamine derivatives as D(2) antagonists/5-HT(1A) partial agonists with potential as atypical antipsychotic agents. J Med Chem 42:3342-55 (1999)  
Target
Name:
5-hydroxytryptamine receptor 1A
Synonyms:
5-HT-1A 5-HT1A 5-hydroxytryptamine receptor 1A (5HT1A) 5ht1a Htr1a Serotonin 1a (5-HT1a) receptor/Adrenergic receptor alpha-1 | Serotonin receptor 1A
Type:
G Protein-Coupled Receptor (GPCR)
Mol. Mass.:
46445.29
Organism:
Rattus norvegicus (rat)
Description:
Binding assays were performed using rat hippocampal membranes.
Residue:
422
  
Inhibitor
Name:
BDBM50079950
Synonyms:
CHEMBL430698 | N-(2,3-Dihydro-benzo[1,4]dioxin-2-ylmethyl)-N'-pyrimidin-2-yl-ethane-1,2-diamine
Type:
Small organic molecule
Emp. Form.:
C15H18N4O2
Mol. Mass.:
286.329
SMILES:
C(CNc1ncccn1)NCC1COc2ccccc2O1
: