Target
D(2) dopamine receptor
Ligand
BDBM50079955
Substrate
Meas. Tech.
ChEMBL_58770 (CHEMBL669158)
Ki
36±n/a nM
Citation
 Birch, AMBradley, PAGill, JCKerrigan, FNeedham, PL N-Substituted (2,3-dihydro-1,4-benzodioxin-2-yl)methylamine derivatives as D(2) antagonists/5-HT(1A) partial agonists with potential as atypical antipsychotic agents. J Med Chem 42:3342-55 (1999)  
Target
Name:
D(2) dopamine receptor
Synonyms:
DOPAMINE D2 DOPAMINE D2 Short Dopamine D2 receptor Drd2
Type:
G Protein-Coupled Receptor (GPCR)
Mol. Mass.:
50931.60
Organism:
Rattus norvegicus (rat)
Description:
P61169
Residue:
444
  
Inhibitor
Name:
BDBM50079955
Synonyms:
(2,3-Dihydro-benzo[1,4]dioxin-2-ylmethyl)-[1-(4-methoxy-phenyl)-piperidin-4-ylmethyl]-amine | CHEMBL111810
Type:
Small organic molecule
Emp. Form.:
C22H28N2O3
Mol. Mass.:
368.4693
SMILES:
COc1ccc(cc1)N1CCC(CNCC2COc3ccccc3O2)CC1
: