Target
D(2) dopamine receptor
Ligand
BDBM50079940
Substrate
Meas. Tech.
ChEMBL_58770 (CHEMBL669158)
Ki
6.9±n/a nM
Citation
 Birch, AMBradley, PAGill, JCKerrigan, FNeedham, PL N-Substituted (2,3-dihydro-1,4-benzodioxin-2-yl)methylamine derivatives as D(2) antagonists/5-HT(1A) partial agonists with potential as atypical antipsychotic agents. J Med Chem 42:3342-55 (1999)  
Target
Name:
D(2) dopamine receptor
Synonyms:
DOPAMINE D2 DOPAMINE D2 Short Dopamine D2 receptor Drd2
Type:
G Protein-Coupled Receptor (GPCR)
Mol. Mass.:
50931.60
Organism:
Rattus norvegicus (rat)
Description:
P61169
Residue:
444
  
Inhibitor
Name:
BDBM50079940
Synonyms:
CHEMBL324076 | [1-(2,3-Dihydro-benzo[1,4]dioxin-2-ylmethyl)-piperidin-4-ylmethyl]-pyrimidin-2-yl-amine
Type:
Small organic molecule
Emp. Form.:
C19H24N4O2
Mol. Mass.:
340.4195
SMILES:
C(Nc1ncccn1)C1CCN(CC2COc3ccccc3O2)CC1
: