Target
D(2) dopamine receptor
Ligand
BDBM50079953
Substrate
Meas. Tech.
ChEMBL_58770 (CHEMBL669158)
Ki
25±n/a nM
Citation
 Birch, AMBradley, PAGill, JCKerrigan, FNeedham, PL N-Substituted (2,3-dihydro-1,4-benzodioxin-2-yl)methylamine derivatives as D(2) antagonists/5-HT(1A) partial agonists with potential as atypical antipsychotic agents. J Med Chem 42:3342-55 (1999)  
Target
Name:
D(2) dopamine receptor
Synonyms:
DOPAMINE D2 DOPAMINE D2 Short Dopamine D2 receptor Drd2
Type:
G Protein-Coupled Receptor (GPCR)
Mol. Mass.:
50931.60
Organism:
Rattus norvegicus (rat)
Description:
P61169
Residue:
444
  
Inhibitor
Name:
BDBM50079953
Synonyms:
3-({[1-(2-Methoxy-phenyl)-piperidin-4-ylmethyl]-amino}-methyl)-2,3-dihydro-benzo[1,4]dioxin-5-ol | CHEMBL115931
Type:
Small organic molecule
Emp. Form.:
C22H28N2O4
Mol. Mass.:
384.4687
SMILES:
COc1ccccc1N1CCC(CNCC2COc3cccc(O)c3O2)CC1
: