Target
cGMP-specific 3',5'-cyclic phosphodiesterase
Ligand
BDBM14363
Substrate
Meas. Tech.
ChEMBL_1896664 (CHEMBL4398699)
IC50
300±n/a nM
Citation
 Bollenbach, MLugnier, CKremer, MSalvat, EMegat, SBihel, FBourguignon, JJBarrot, MSchmitt, M Design and synthesis of 3-aminophthalazine derivatives and structural analogues as PDE5 inhibitors: anti-allodynic effect against neuropathic pain in a mouse model. Eur J Med Chem 177:269-290 (2019)  
Target
Name:
cGMP-specific 3',5'-cyclic phosphodiesterase
Synonyms:
PDE5 PDE5A_BOVIN | Phosphodiesterase 5A
Type:
PROTEIN
Mol. Mass.:
98615.45
Organism:
Bos taurus
Description:
ChEMBL_155186
Residue:
865
  
Inhibitor
Name:
BDBM14363
Synonyms:
3-(2-propoxyphenyl)-2,4,7,8,9-pentazabicyclo[4.3.0]nona-1,3,6-trien-5-one Tocris-0947 | Zaprinast
Type:
Small organic molecule
Emp. Form.:
C13H13N5O2
Mol. Mass.:
271.2746
SMILES:
CCCOc1ccccc1-c1nc2nn[nH]c2c(=O)[nH]1
: