Target
Fibroblast growth factor receptor 1
Ligand
BDBM50363397
Substrate
Meas. Tech.
ChEMBL_1897146 (CHEMBL4399181)
IC50
1.5±n/a nM
Citation
 Abdel-Mohsen, HTOmar, MAEl Kerdawy, AMMahmoud, AEEAli, MMEl Diwani, HI Novel potent substituted 4-amino-2-thiopyrimidines as dual VEGFR-2 and BRAF kinase inhibitors. Eur J Med Chem 179:707-722 (2019)  
Target
Name:
Fibroblast growth factor receptor 1
Synonyms:
BFGFR Basic fibroblast growth factor receptor 1 (FGFR1) CEK FGFR-1 FGFR-1, (FL) FGFR1_HUMAN FLT2 Fibroblast growth factor receptor 1 (FGFR-1) Fms-like tyrosine kinase 2 N-sam bFGF-R | c-fgr
Type:
Receptor
Mol. Mass.:
91861.70
Organism:
Homo sapiens (Human)
Description:
P11362
Residue:
822
  
Inhibitor
Name:
BDBM50363397
Synonyms:
CHEMBL1946170 US10183928, Regorafenib US10227329, Compound Regorafenib US10584114, Compound Regorafenib US11279688, Compound Regorafenib
Type:
Small organic molecule
Emp. Form.:
C21H15ClF4N4O3
Mol. Mass.:
482.815
SMILES:
CNC(=O)c1cc(Oc2ccc(NC(=O)Nc3ccc(Cl)c(c3)C(F)(F)F)c(F)c2)ccn1
: