Target
Vascular endothelial growth factor receptor 3
Ligand
BDBM50363397
Substrate
Meas. Tech.
ChEMBL_1897224 (CHEMBL4399259)
IC50
1.5±n/a nM
Citation
 Abdel-Mohsen, HTOmar, MAEl Kerdawy, AMMahmoud, AEEAli, MMEl Diwani, HI Novel potent substituted 4-amino-2-thiopyrimidines as dual VEGFR-2 and BRAF kinase inhibitors. Eur J Med Chem 179:707-722 (2019)  
Target
Name:
Vascular endothelial growth factor receptor 3
Synonyms:
Flt-4 Fms-like tyrosine kinase 4 VEGFR-3 Vegfr3
Type:
Kinase domain
Mol. Mass.:
153007.70
Organism:
Mus musculus (mouse)
Description:
P35917
Residue:
1363
  
Inhibitor
Name:
BDBM50363397
Synonyms:
CHEMBL1946170 US10183928, Regorafenib US10227329, Compound Regorafenib US10584114, Compound Regorafenib US11279688, Compound Regorafenib
Type:
Small organic molecule
Emp. Form.:
C21H15ClF4N4O3
Mol. Mass.:
482.815
SMILES:
CNC(=O)c1cc(Oc2ccc(NC(=O)Nc3ccc(Cl)c(c3)C(F)(F)F)c(F)c2)ccn1
: