Target
Vascular endothelial growth factor receptor 2
Ligand
BDBM50525512
Substrate
Meas. Tech.
ChEMBL_1897143 (CHEMBL4399178)
IC50
220±n/a nM
Citation
 Abdel-Mohsen, HTOmar, MAEl Kerdawy, AMMahmoud, AEEAli, MMEl Diwani, HI Novel potent substituted 4-amino-2-thiopyrimidines as dual VEGFR-2 and BRAF kinase inhibitors. Eur J Med Chem 179:707-722 (2019)  
Target
Name:
Vascular endothelial growth factor receptor 2
Synonyms:
CD_antigen=CD309 Fetal liver kinase 1 (FLK-1) KDR Protein-tyrosine kinase receptor Flk-1 VEGFR-2 VEGFR2 Vascular Endothelial Growth Factor Receptor Kinase 2 Vascular endothelial growth factor receptor 2 (KDR) Vascular endothelial growth factor receptor 2 (VEGFR2) Vascular endothelial growth factor receptor-2 (VEGFR-2)
Type:
Receptor Tyrosine Kinase
Mol. Mass.:
151510.97
Organism:
Homo sapiens (Human)
Description:
P35968
Residue:
1356
  
Inhibitor
Name:
BDBM50525512
Synonyms:
CHEMBL4465126
Type:
Small organic molecule
Emp. Form.:
C20H16ClN3O2S
Mol. Mass.:
397.878
SMILES:
CC(=O)c1ccc(Nc2ccnc(SCC(=O)c3ccc(Cl)cc3)n2)cc1
: