Target
Serine/threonine-protein kinase B-raf
Ligand
BDBM50525496
Substrate
Meas. Tech.
ChEMBL_1897144 (CHEMBL4399179)
IC50
110±n/a nM
Citation
 Abdel-Mohsen, HTOmar, MAEl Kerdawy, AMMahmoud, AEEAli, MMEl Diwani, HI Novel potent substituted 4-amino-2-thiopyrimidines as dual VEGFR-2 and BRAF kinase inhibitors. Eur J Med Chem 179:707-722 (2019)  
Target
Name:
Serine/threonine-protein kinase B-raf
Synonyms:
B-RAF B-Raf proto-oncogene serine/threonine-protein kinase BRAF1 RAFB1 v-Raf murine sarcoma viral oncogene homolog B1
Type:
Serine/threonine-protein kinase
Mol. Mass.:
84446.00
Organism:
Homo sapiens (Human)
Description:
P15056
Residue:
766
  
Inhibitor
Name:
BDBM50525496
Synonyms:
CHEMBL4449189
Type:
Small organic molecule
Emp. Form.:
C22H21FN4O2S
Mol. Mass.:
424.491
SMILES:
Fc1ccc(cc1)C(=O)CSc1nccc(Nc2ccc(cc2)N2CCOCC2)n1
: