Target
Tyrosine-protein kinase Lck
Ligand
BDBM50080265
Substrate
Meas. Tech.
ChEBML_96908
Kd
400000±n/a nM
Citation
 Hajduk, PJZhou, MMFesik, SW NMR-based discovery of phosphotyrosine mimetics that bind to the Lck SH2 domain. Bioorg Med Chem Lett 9:2403-6 (1999)  
Target
Name:
Tyrosine-protein kinase Lck
Synonyms:
2.7.10.2 LCK_HUMAN Leukocyte C-terminal Src kinase Lymphocyte-specific protein tyrosine kinase Protein YT16 Proto-oncogene tyrosine-protein kinase LCK T cell-specific protein-tyrosine kinase
Type:
Mol. Mass.:
57987.83
Organism:
Homo sapiens (Human)
Description:
P06239
Residue:
509
  
Inhibitor
Name:
BDBM50080265
Synonyms:
2-Amino-3-(4-phosphonooxy-phenyl)-propionic acid | CHEMBL310565
Type:
Small organic molecule
Emp. Form.:
C9H12NO6P
Mol. Mass.:
261.1684
SMILES:
NC(Cc1ccc(OP(O)(O)=O)cc1)C(O)=O
: