Target
Sodium/bile acid cotransporter
Ligand
BDBM50030474
Substrate
Meas. Tech.
ChEMBL_1897789 (CHEMBL4399824)
IC50
5100±n/a nM
Citation
 Zhao, SZhen, YFu, LGao, FZhou, XHuang, SZhang, L Design, synthesis and biological evaluation of benzamide derivatives as novel NTCP inhibitors that induce apoptosis in HepG2 cells. Bioorg Med Chem Lett 29:0 (2019)  
Target
Name:
Sodium/bile acid cotransporter
Synonyms:
Bile acid transporter NTCP_HUMAN | SLC10A1
Type:
PROTEIN
Mol. Mass.:
38131.81
Organism:
Homo sapiens (Human)
Description:
ChEMBL_838517
Residue:
349
  
Inhibitor
Name:
BDBM50030474
Synonyms:
Avandamet Avandia CHEBI:50122 US10744117, Compound Rosiglitazone | US9562012, rosiglitazone
Type:
Small organic molecule
Emp. Form.:
C18H19N3O3S
Mol. Mass.:
357.427
SMILES:
CN(CCOc1ccc(CC2SC(=O)NC2=O)cc1)c1ccccn1
: