Target
Peptidyl-prolyl cis-trans isomerase FKBP14
Ligand
BDBM50080528
Substrate
Meas. Tech.
ChEMBL_66427 (CHEMBL682335)
Ki
76200.0±n/a nM
Citation
 Christner, CWyrwa, RMarsch, SKüllertz, GThiericke, RGrabley, SSchumann, DFischer, G Synthesis and cytotoxic evaluation of cycloheximide derivatives as potential inhibitors of FKBP12 with neuroregenerative properties. J Med Chem 42:3615-22 (1999)  
Target
Name:
Peptidyl-prolyl cis-trans isomerase FKBP14
Synonyms:
FK506 binding protein 14 FKBP14 | FKBP22
Type:
PROTEIN
Mol. Mass.:
24168.38
Organism:
Homo sapiens (Human)
Description:
ChEMBL_66427
Residue:
211
  
Inhibitor
Name:
BDBM50080528
Synonyms:
3-((R)-2-((1S,3S,5S)-3,5-dimethyl-2-oxocyclohexyl)-2-hydroxyethyl)glutarimide CHEMBL123292 Zykloheximid cycloheximide | med.21724, Compound Cycloheximide
Type:
Small organic molecule
Emp. Form.:
C15H23NO4
Mol. Mass.:
281.3474
SMILES:
C[C@H]1C[C@H](C)C(=O)[C@@H](C1)[C@H](O)CC1CC(=O)NC(=O)C1
: