Target
Adenosine receptor A1
Ligand
BDBM50080542
Substrate
Meas. Tech.
ChEMBL_28393 (CHEMBL636650)
EC50
34900±n/a nM
Citation
 van der Klein, PAKourounakis, APIJzerman, AP Allosteric modulation of the adenosine A(1) receptor. Synthesis and biological evaluation of novel 2-amino-3-benzoylthiophenes as allosteric enhancers of agonist binding. J Med Chem 42:3629-35 (1999)  
Target
Name:
Adenosine receptor A1
Synonyms:
AA1R_RAT ADENOSINE A1 high Adenosine A1 receptor (A1) Adenosine receptors A1 | Adora1
Type:
Protein
Mol. Mass.:
36704.13
Organism:
Rattus norvegicus (rat)
Description:
Residue:
326
  
Inhibitor
Name:
BDBM50080542
Synonyms:
(2-Amino-4,5,6,7-tetrahydro-benzo[b]thiophen-3-yl)-p-tolyl-methanone | CHEMBL331504
Type:
Small organic molecule
Emp. Form.:
C16H17NOS
Mol. Mass.:
271.377
SMILES:
Cc1ccc(cc1)C(=O)c1c(N)sc2CCCCc12
: