Target
Adenosine receptor A1
Ligand
BDBM50080547
Substrate
Meas. Tech.
ChEMBL_28393 (CHEMBL636650)
EC50
6200±n/a nM
Citation
 van der Klein, PAKourounakis, APIJzerman, AP Allosteric modulation of the adenosine A(1) receptor. Synthesis and biological evaluation of novel 2-amino-3-benzoylthiophenes as allosteric enhancers of agonist binding. J Med Chem 42:3629-35 (1999)  
Target
Name:
Adenosine receptor A1
Synonyms:
AA1R_RAT ADENOSINE A1 high Adenosine A1 receptor (A1) Adenosine receptors A1 | Adora1
Type:
Protein
Mol. Mass.:
36704.13
Organism:
Rattus norvegicus (rat)
Description:
Residue:
326
  
Inhibitor
Name:
BDBM50080547
Synonyms:
(2-Amino-4,5,6,7-tetrahydro-benzo[b]thiophen-3-yl)-(3,4-dichloro-phenyl)-methanone | CHEMBL123763
Type:
Small organic molecule
Emp. Form.:
C15H13Cl2NOS
Mol. Mass.:
326.241
SMILES:
Nc1sc2CCCCc2c1C(=O)c1ccc(Cl)c(Cl)c1
: