Target
Adenosine receptor A1
Ligand
BDBM50080549
Substrate
Meas. Tech.
ChEMBL_28393 (CHEMBL636650)
EC50
32000±n/a nM
Citation
 van der Klein, PAKourounakis, APIJzerman, AP Allosteric modulation of the adenosine A(1) receptor. Synthesis and biological evaluation of novel 2-amino-3-benzoylthiophenes as allosteric enhancers of agonist binding. J Med Chem 42:3629-35 (1999)  
Target
Name:
Adenosine receptor A1
Synonyms:
AA1R_RAT ADENOSINE A1 high Adenosine A1 receptor (A1) Adenosine receptors A1 | Adora1
Type:
Protein
Mol. Mass.:
36704.13
Organism:
Rattus norvegicus (rat)
Description:
Residue:
326
  
Inhibitor
Name:
BDBM50080549
Synonyms:
CHEMBL123002 | [2-Amino-6-(3,4-dichloro-benzyl)-4,5,6,7-tetrahydro-thieno[2,3-c]pyridin-3-yl]-(4-chloro-phenyl)-methanone
Type:
Small organic molecule
Emp. Form.:
C21H17Cl3N2OS
Mol. Mass.:
451.796
SMILES:
Nc1sc2CN(Cc3ccc(Cl)c(Cl)c3)CCc2c1C(=O)c1ccc(Cl)cc1
: