Target
5-hydroxytryptamine receptor 2A
Ligand
BDBM50080797
Substrate
Meas. Tech.
ChEMBL_2243 (CHEMBL617188)
Ki
>4350±n/a nM
Citation
 Kesten, SRHeffner, TGJohnson, SJPugsley, TAWright, JLWise, LD Design, synthesis, and evaluation of chromen-2-ones as potent and selective human dopamine D4 antagonists. J Med Chem 42:3718-25 (1999)  
Target
Name:
5-hydroxytryptamine receptor 2A
Synonyms:
5-HT2A 5HTR2A Serotonin 2a (5-HT2a) receptor
Type:
Enzyme Catalytic Domain
Mol. Mass.:
52578.24
Organism:
BOVINE
Description:
5-HT2A HTR2A BOVINE::Q75Z89
Residue:
470
  
Inhibitor
Name:
BDBM50080797
Synonyms:
7-[(2-Phenylamino-ethylamino)-methyl]-chromen-2-one | CHEMBL332154
Type:
Small organic molecule
Emp. Form.:
C18H18N2O2
Mol. Mass.:
294.3477
SMILES:
O=c1ccc2ccc(CNCCNc3ccccc3)cc2o1
: