Target
Kallikrein-14
Ligand
BDBM50525917
Substrate
Meas. Tech.
ChEMBL_1898431 (CHEMBL4400466)
IC50
794±n/a nM
Citation
 Walker, ALDenis, ABingham, RPBouillot, AEdgar, EVFerrie, AHolmes, DSLaroze, ALiddle, JFouchet, MHMoquette, ANassau, PPearce, ACPolyakova, OSmith, KJThomas, PThorpe, JHTrottet, LWang, YHovnanian, A Design and development of a series of borocycles as selective, covalent kallikrein 5 inhibitors. Bioorg Med Chem Lett 29:0 (2019)  
Target
Name:
Kallikrein-14
Synonyms:
KLK-L6 KLK14_HUMAN Kallikrein 14 Kallikrein-like protein 6 | hK14
Type:
PROTEIN
Mol. Mass.:
29136.99
Organism:
Homo sapiens (Human)
Description:
ChEMBL_1282452
Residue:
267
  
Inhibitor
Name:
BDBM50525917
Synonyms:
CHEMBL4579813
Type:
Small organic molecule
Emp. Form.:
C21H21BClN3O3
Mol. Mass.:
409.674
SMILES:
Cl.NC(=N)c1ccc(cc1OCc1cccnc1)C1Cc2ccccc2B(O)O1
: