Target
Kallikrein-14
Ligand
BDBM50525900
Substrate
Meas. Tech.
ChEMBL_1898431 (CHEMBL4400466)
IC50
398±n/a nM
Citation
 Walker, ALDenis, ABingham, RPBouillot, AEdgar, EVFerrie, AHolmes, DSLaroze, ALiddle, JFouchet, MHMoquette, ANassau, PPearce, ACPolyakova, OSmith, KJThomas, PThorpe, JHTrottet, LWang, YHovnanian, A Design and development of a series of borocycles as selective, covalent kallikrein 5 inhibitors. Bioorg Med Chem Lett 29:0 (2019)  
Target
Name:
Kallikrein-14
Synonyms:
KLK-L6 KLK14_HUMAN Kallikrein 14 Kallikrein-like protein 6 | hK14
Type:
PROTEIN
Mol. Mass.:
29136.99
Organism:
Homo sapiens (Human)
Description:
ChEMBL_1282452
Residue:
267
  
Inhibitor
Name:
BDBM50525900
Synonyms:
CHEMBL4460168
Type:
Small organic molecule
Emp. Form.:
C22H23BClN3O3
Mol. Mass.:
423.7
SMILES:
Cl.Cc1cccc2CC(OB(O)c12)c1ccc(C(N)=N)c(OCc2cccnc2)c1
: