Target
Suppressor of tumorigenicity 14 protein
Ligand
BDBM50525899
Substrate
Meas. Tech.
ChEMBL_1898432 (CHEMBL4400467)
IC50
1995±n/a nM
Citation
 Walker, ALDenis, ABingham, RPBouillot, AEdgar, EVFerrie, AHolmes, DSLaroze, ALiddle, JFouchet, MHMoquette, ANassau, PPearce, ACPolyakova, OSmith, KJThomas, PThorpe, JHTrottet, LWang, YHovnanian, A Design and development of a series of borocycles as selective, covalent kallikrein 5 inhibitors. Bioorg Med Chem Lett 29:0 (2019)  
Target
Name:
Suppressor of tumorigenicity 14 protein
Synonyms:
Epithin MT-SP1 PRSS14 SNC19 ST14_HUMAN Suppressor of tumorigenicity 14 protein TADG15
Type:
Single-pass type II membrane protein
Mol. Mass.:
94769.23
Organism:
Homo sapiens (Human)
Description:
Q9Y5Y6
Residue:
855
  
Inhibitor
Name:
BDBM50525899
Synonyms:
CHEMBL4465265
Type:
Small organic molecule
Emp. Form.:
C22H20BClF3N3O3
Mol. Mass.:
477.672
SMILES:
Cl.NC(=N)c1ccc(cc1OCc1cccnc1)[C@@H]1Cc2ccc(cc2B(O)O1)C(F)(F)F
: