Target
5-hydroxytryptamine receptor 2A
Ligand
BDBM35254
Substrate
Meas. Tech.
ChEMBL_1898947 (CHEMBL4401062)
Ki
4.6±n/a nM
Citation
 ?lifirski, GKról, MKleps, JUlenberg, SBelka, MB?czek, TSiwek, AStachowicz, KSzewczyk, BNowak, GBojarski, AKozio?, AETur?o, JHerold, F Synthesis of novel pyrido[1,2-c]pyrimidine derivatives with rigidized tryptamine moiety as potential SSRI and 5-HT Eur J Med Chem 166:144-158 (2019)  
Target
Name:
5-hydroxytryptamine receptor 2A
Synonyms:
5-HT-2 5-HT2A 5-hydroxytryptamine receptor 2A (5HT-2A) 5HT2A_HUMAN HTR2A | Serotonin receptor 2A
Type:
undefined
Mol. Mass.:
52607.65
Organism:
Homo sapiens (Human)
Description:
P28223
Residue:
471
  
Inhibitor
Name:
BDBM35254
Synonyms:
2-methyl-4-(4-methylpiperazin-1-yl)-10H-thieno[2,3-b][1,5]benzodiazepine Olansek Zyprexa | olanzapine
Type:
Small organic molecule
Emp. Form.:
C17H20N4S
Mol. Mass.:
312.432
SMILES:
CN1CCN(CC1)C1=Nc2ccccc2Nc2sc(C)cc12
: