Target
Glutathione S-transferase omega-1
Ligand
BDBM50526127
Substrate
Meas. Tech.
ChEMBL_1899134 (CHEMBL4401249)
IC50
270±n/a nM
Citation
 Dai, WSamanta, SXue, DPetrunak, EMStuckey, JAHan, YSun, DWu, YNeamati, N Structure-Based Design of N-(5-Phenylthiazol-2-yl)acrylamides as Novel and Potent Glutathione S-Transferase Omega 1 Inhibitors. J Med Chem 62:3068-3087 (2019)  
Target
Name:
Glutathione S-transferase omega-1
Synonyms:
GSTO 1-1 GSTO1_HUMAN Glutathione S-transferase omega-1 glutathione S-transferase omega-1 isoform 1
Type:
PROTEIN
Mol. Mass.:
27565.54
Organism:
Homo sapiens (Human)
Description:
EBI_11172
Residue:
241
  
Inhibitor
Name:
BDBM50526127
Synonyms:
CHEMBL4459484
Type:
Small organic molecule
Emp. Form.:
C15H14N2O3S
Mol. Mass.:
302.348
SMILES:
CCOC(=O)c1sc(NC(=O)C=C)nc1-c1ccccc1
: