Target
Glutathione S-transferase omega-1
Ligand
BDBM50526153
Substrate
Meas. Tech.
ChEMBL_1899134 (CHEMBL4401249)
IC50
190±n/a nM
Citation
 Dai, WSamanta, SXue, DPetrunak, EMStuckey, JAHan, YSun, DWu, YNeamati, N Structure-Based Design of N-(5-Phenylthiazol-2-yl)acrylamides as Novel and Potent Glutathione S-Transferase Omega 1 Inhibitors. J Med Chem 62:3068-3087 (2019)  
Target
Name:
Glutathione S-transferase omega-1
Synonyms:
GSTO 1-1 GSTO1_HUMAN Glutathione S-transferase omega-1 glutathione S-transferase omega-1 isoform 1
Type:
PROTEIN
Mol. Mass.:
27565.54
Organism:
Homo sapiens (Human)
Description:
EBI_11172
Residue:
241
  
Inhibitor
Name:
BDBM50526153
Synonyms:
CHEMBL4525870
Type:
Small organic molecule
Emp. Form.:
C18H16N2O3S
Mol. Mass.:
340.396
SMILES:
Cc1cc(CN(C(=O)C=C)c2cc(cs2)-c2ccccc2O)on1
: