Target
Sodium- and chloride-dependent GABA transporter 1
Ligand
BDBM50526262
Substrate
Meas. Tech.
ChEMBL_1899631 (CHEMBL4401746)
Ki
5.1±n/a nM
Citation
 Kern, FWanner, KT Screening oxime libraries by means of mass spectrometry (MS) binding assays: Identification of new highly potent inhibitors to optimized inhibitors ?-aminobutyric acid transporter 1. Bioorg Med Chem 27:1232-1245 (2019)  
Target
Name:
Sodium- and chloride-dependent GABA transporter 1
Synonyms:
GABA transporter Gat-1 SC6A1_RAT Solute carrier family 6 member 1
Type:
PROTEIN
Mol. Mass.:
67006.26
Organism:
Rattus norvegicus
Description:
ChEMBL_1472611
Residue:
599
  
Inhibitor
Name:
BDBM50526262
Synonyms:
CHEMBL4439989
Type:
Small organic molecule
Emp. Form.:
C21H21Cl3N2O3
Mol. Mass.:
455.762
SMILES:
Cl.OC(=O)C1=CCCN(CCO\N=C\c2ccccc2-c2ccc(Cl)cc2Cl)C1
: