Target
Prostaglandin E2 receptor EP3 subtype
Ligand
BDBM50081435
Substrate
Meas. Tech.
ChEBML_158320
Ki
2200±n/a nM
Citation
 Ruel, RLacombe, PAbramovitz, MGodbout, CLamontagne, SRochette, CSawyer, NStocco, RTremblay, NMMetters, KMLabelle, M New class of biphenylene dibenzazocinones as potent ligands for the human EP1 prostanoid receptor. Bioorg Med Chem Lett 9:2699-704 (1999)  
Target
Name:
Prostaglandin E2 receptor EP3 subtype
Synonyms:
PE2R3_HUMAN PGE2-R Prostaglandin E2 receptor Prostaglandin E2 receptor EP3 subtype (EP3) Prostaglandin E2 receptor EP3D subtype (EP3D) | Prostanoid EP3 receptor
Type:
Enzyme
Mol. Mass.:
43335.03
Organism:
Homo sapiens (Human)
Description:
P43115
Residue:
390
  
Inhibitor
Name:
BDBM50081435
Synonyms:
CHEMBL328697 | sulfonylurea analogue
Type:
Small organic molecule
Emp. Form.:
C35H31N3O4S2
Mol. Mass.:
621.768
SMILES:
O=C(NCCc1cccs1)NS(=O)(=O)c1ccccc1-c1ccc(CN2c3ccccc3CCc3ccccc3C2=O)cc1
: