Target
Prostaglandin D2 receptor
Ligand
BDBM50081444
Substrate
Meas. Tech.
ChEBML_158170
Ki
2400±n/a nM
Citation
 Ruel, RLacombe, PAbramovitz, MGodbout, CLamontagne, SRochette, CSawyer, NStocco, RTremblay, NMMetters, KMLabelle, M New class of biphenylene dibenzazocinones as potent ligands for the human EP1 prostanoid receptor. Bioorg Med Chem Lett 9:2699-704 (1999)  
Target
Name:
Prostaglandin D2 receptor
Synonyms:
PD2R_HUMAN Prostaglandin D2 Prostanoid DP receptor
Type:
Enzyme
Mol. Mass.:
40288.87
Organism:
Homo sapiens (Human)
Description:
Q13258
Residue:
359
  
Inhibitor
Name:
BDBM50081444
Synonyms:
4'-(6-Oxo-11,12-dihydro-6H-dibenzo[b,f]azocin-5-ylmethyl)-biphenyl-2-sulfonic acid (2-methyl-2-phenyl-propionyl)-amide | CHEMBL314533
Type:
Small organic molecule
Emp. Form.:
C38H34N2O4S
Mol. Mass.:
614.753
SMILES:
CC(C)(C(=O)NS(=O)(=O)c1ccccc1-c1ccc(CN2c3ccccc3CCc3ccccc3C2=O)cc1)c1ccccc1
: