Target
Thromboxane A2 receptor
Ligand
BDBM50081440
Substrate
Meas. Tech.
ChEBML_158475
Ki
1500±n/a nM
Citation
 Ruel, RLacombe, PAbramovitz, MGodbout, CLamontagne, SRochette, CSawyer, NStocco, RTremblay, NMMetters, KMLabelle, M New class of biphenylene dibenzazocinones as potent ligands for the human EP1 prostanoid receptor. Bioorg Med Chem Lett 9:2699-704 (1999)  
Target
Name:
Thromboxane A2 receptor
Synonyms:
Prostanoid TP receptor TBXA2R Thromboxane Thromboxane Beta
Type:
Enyzme
Mol. Mass.:
37445.28
Organism:
Homo sapiens (Human)
Description:
P21731
Residue:
343
  
Inhibitor
Name:
BDBM50081440
Synonyms:
4'-(6-Oxo-11,12-dihydro-6H-dibenzo[b,f]azocin-5-ylmethyl)-biphenyl-2-sulfonic acid ((S)-3,3,3-trifluoro-2-methoxy-2-phenyl-propionyl)-amide | CHEMBL415310
Type:
Small organic molecule
Emp. Form.:
C38H31F3N2O5S
Mol. Mass.:
684.723
SMILES:
CO[C@](C(=O)NS(=O)(=O)c1ccccc1-c1ccc(CN2c3ccccc3CCc3ccccc3C2=O)cc1)(c1ccccc1)C(F)(F)F
: