Target
Nitric oxide synthase, inducible
Ligand
BDBM50526359
Substrate
Meas. Tech.
ChEMBL_1899890 (CHEMBL4402005)
Ki
1635±n/a nM
Citation
 Do, HTLi, HChreifi, GPoulos, TLSilverman, RB Optimization of Blood-Brain Barrier Permeability with Potent and Selective Human Neuronal Nitric Oxide Synthase Inhibitors Having a 2-Aminopyridine Scaffold. J Med Chem 62:2690-2707 (2019)  
Target
Name:
Nitric oxide synthase, inducible
Synonyms:
HEP-NOS Inducible NO synthase NOS type II NOS2A Nitric oxide synthase, inducible (iNOS) | iNOS
Type:
Homodimer
Mol. Mass.:
131141.95
Organism:
Homo sapiens (Human)
Description:
P35228
Residue:
1153
  
Inhibitor
Name:
BDBM50526359
Synonyms:
CHEMBL4450896
Type:
Small organic molecule
Emp. Form.:
C21H27F2N3
Mol. Mass.:
359.456
SMILES:
CN1CCC[C@H]1CCc1cc(F)c(F)c(CCc2cc(C)cc(N)n2)c1
: