Target
Transitional endoplasmic reticulum ATPase
Ligand
BDBM50526411
Substrate
Meas. Tech.
ChEMBL_1899994 (CHEMBL4402109)
Ki
33±n/a nM
Citation
 Ding, RZhang, TWilson, DJXie, JWilliams, JXu, YYe, YChen, L Discovery of Irreversible p97 Inhibitors. J Med Chem 62:2814-2829 (2019)  
Target
Name:
Transitional endoplasmic reticulum ATPase
Synonyms:
TERA_HUMAN VCP Valosin-containing protein
Type:
Enzyme
Mol. Mass.:
89300.63
Organism:
Homo sapiens (Human)
Description:
P55072
Residue:
806
  
Inhibitor
Name:
BDBM50526411
Synonyms:
CHEMBL4438398
Type:
Small organic molecule
Emp. Form.:
C26H23N5O2
Mol. Mass.:
437.4931
SMILES:
Cc1cc2c(NC(=O)C#C)cccc2n1-c1nc2CCOCc2c(NCc2ccccc2)n1
: