Target
Transitional endoplasmic reticulum ATPase
Ligand
BDBM50526416
Substrate
Meas. Tech.
ChEMBL_1899994 (CHEMBL4402109)
Ki
24±n/a nM
Citation
 Ding, RZhang, TWilson, DJXie, JWilliams, JXu, YYe, YChen, L Discovery of Irreversible p97 Inhibitors. J Med Chem 62:2814-2829 (2019)  
Target
Name:
Transitional endoplasmic reticulum ATPase
Synonyms:
TERA_HUMAN VCP Valosin-containing protein
Type:
Enzyme
Mol. Mass.:
89300.63
Organism:
Homo sapiens (Human)
Description:
P55072
Residue:
806
  
Inhibitor
Name:
BDBM50526416
Synonyms:
CHEMBL4535337
Type:
Small organic molecule
Emp. Form.:
C28H28N6O
Mol. Mass.:
464.5615
SMILES:
Cc1cc2c(cccc2n1-c1nc2CCCCc2c(NCc2ccccc2)n1)C(=O)NCCC#N
: