Target
Transitional endoplasmic reticulum ATPase
Ligand
BDBM50526421
Substrate
Meas. Tech.
ChEMBL_1899994 (CHEMBL4402109)
Ki
41±n/a nM
Citation
 Ding, RZhang, TWilson, DJXie, JWilliams, JXu, YYe, YChen, L Discovery of Irreversible p97 Inhibitors. J Med Chem 62:2814-2829 (2019)  
Target
Name:
Transitional endoplasmic reticulum ATPase
Synonyms:
TERA_HUMAN VCP Valosin-containing protein
Type:
Enzyme
Mol. Mass.:
89300.63
Organism:
Homo sapiens (Human)
Description:
P55072
Residue:
806
  
Inhibitor
Name:
BDBM50526421
Synonyms:
CHEMBL4446356
Type:
Small organic molecule
Emp. Form.:
C28H31N5O
Mol. Mass.:
453.5786
SMILES:
CCCNC(=O)c1cccc2n(c(C)cc12)-c1nc2CCCCc2c(NCc2ccccc2)n1
: