Target
Aminodeoxyfutalosine synthase
Ligand
BDBM50526602
Substrate
Meas. Tech.
ChEMBL_1900272 (CHEMBL4402387)
IC50
839000±n/a nM
Citation
 Joshi, SFedoseyenko, DMahanta, NDucati, RGFeng, MSchramm, VLBegley, TP Antibacterial Strategy against  ACS Med Chem Lett 10:363-366 (2019)  
Target
Name:
Aminodeoxyfutalosine synthase
Synonyms:
2.5.1.120 Aminodeoxyfutalosine synthase MQNE_THET8 mqnE
Type:
PROTEIN
Mol. Mass.:
42621.64
Organism:
Thermus thermophilus (strain HB8 / ATCC 27634 / DSM 579)
Description:
ChEMBL_119077
Residue:
372
  
Inhibitor
Name:
BDBM50526602
Synonyms:
CHEMBL4534412
Type:
Small organic molecule
Emp. Form.:
C21H23N5O7
Mol. Mass.:
457.4366
SMILES:
Nc1ncnc2n(cnc12)[C@@H]1O[C@H](CCC(Cc2cccc(c2)C(O)=O)C(O)=O)[C@@H](O)[C@H]1O
: