Target
5-hydroxytryptamine receptor 2A
Ligand
BDBM50081704
Substrate
Meas. Tech.
ChEMBL_2597 (CHEMBL617465)
Ki
400±n/a nM
Citation
 Gerasimov, MMarona-Lewicka, DKurrasch-Orbaugh, DMQandil, AMNichols, DE Further studies on oxygenated tryptamines with LSD-like activity incorporating a chiral pyrrolidine moiety into the side chain. J Med Chem 42:4257-63 (1999)  
Target
Name:
5-hydroxytryptamine receptor 2A
Synonyms:
5-HT-2A 5-HT2A 5-hydroxytryptamine receptor 2A (5HT2A) Htr2 Serotonin Receptor 2A
Type:
G Protein-Coupled Receptor (GPCR)
Mol. Mass.:
52852.05
Organism:
Rattus norvegicus (rat)
Description:
Rat cortex membranes 5-HT2A receptors.
Residue:
471
  
Inhibitor
Name:
BDBM50081704
Synonyms:
5-Methoxy-3-((R)-1-methyl-pyrrolidin-2-ylmethyl)-1H-indole | CHEMBL137485
Type:
Small organic molecule
Emp. Form.:
C15H20N2O
Mol. Mass.:
244.3321
SMILES:
COc1ccc2[nH]cc(C[C@H]3CCCN3C)c2c1
: