Target
Glutamate receptor ionotropic, NMDA 3A
Ligand
BDBM50081749
Substrate
Meas. Tech.
ChEMBL_143313 (CHEMBL753015)
IC50
26000±n/a nM
Citation
 Wright, JLGregory, TFBoxer, PAMeltzer, LTSerpa, KAWise, LD Discovery of subtype-selective NMDA receptor ligands: 4-benzyl-1-piperidinylalkynylpyrroles, pyrazoles and imidazoles as NR1A/2B antagonists. Bioorg Med Chem Lett 9:2815-8 (1999)  
Target
Name:
Glutamate receptor ionotropic, NMDA 3A
Synonyms:
Glutamate [NMDA] receptor subunit 3A Grin3a NMDA receptor subunit 3A-1 (GluN3A)
Type:
Protein
Mol. Mass.:
127618.95
Organism:
Rattus norvegicus (Rat)
Description:
Q9R1M7
Residue:
1135
  
Inhibitor
Name:
BDBM50081749
Synonyms:
4-(4-Chloro-benzyl)-1-[4-(1H-imidazol-4-yl)-but-3-ynyl]-piperidine | CHEMBL441269
Type:
Small organic molecule
Emp. Form.:
C19H22ClN3
Mol. Mass.:
327.851
SMILES:
Clc1ccc(CC2CCN(CCC#Cc3cnc[nH]3)CC2)cc1
: